Target
Chymotrypsinogen A
Ligand
BDBM50104175
Substrate
Meas. Tech.
ChEMBL_216786 (CHEMBL817062)
Ki
240±n/a nM
Citation
 Harvey, AJAbell, AD Alpha-ketoester-based photobiological switches: synthesis, peptide chain extension and assay against alpha-chymotrypsin. Bioorg Med Chem Lett 11:2441-4 (2001)  
Target
Name:
Chymotrypsinogen A
Synonyms:
Alpha-chymotrypsin Chymotrypsin A Chymotrypsin A chain B Chymotrypsinogen A | alpha-Chymotrypsin (α-Chymotrypsin)
Type:
Serine protease
Mol. Mass.:
25670.88
Organism:
Bos taurus (bovine)
Description:
Residue:
245
  
Inhibitor
Name:
BDBM50104175
Synonyms:
(S)-2-Oxo-4-phenyl-3-(4-phenylazo-benzoylamino)-butyric acid methyl ester | CHEMBL312679
Type:
Small organic molecule
Emp. Form.:
C24H21N3O4
Mol. Mass.:
415.4412
SMILES:
COC(=O)C(=O)[C@H](Cc1ccccc1)NC(=O)c1ccc(cc1)N=Nc1ccccc1
: