Target
B-cell lymphoma 6 protein
Ligand
BDBM50546197
Substrate
Meas. Tech.
ChEMBL_2014752 (CHEMBL4668330)
IC50
3.0±n/a nM
Citation
 Hanan, EJLiang, JWang, XBlake, RABlaquiere, NStaben, ST Monomeric Targeted Protein Degraders. J Med Chem 63:11330-11361 (2020)  
Target
Name:
B-cell lymphoma 6 protein
Synonyms:
B-cell lymphoma 5 protein BCL-5 BCL5 BCL6_HUMAN LAZ3 ZBTB27 Zinc finger and BTB domain-containing protein 27 | Zinc finger protein 51
Type:
PROTEIN
Mol. Mass.:
78866.89
Organism:
Homo sapiens
Description:
ChEMBL_117695
Residue:
706
  
Inhibitor
Name:
BDBM50546197
Synonyms:
CHEMBL4755229
Type:
Small organic molecule
Emp. Form.:
C26H32ClN7O5
Mol. Mass.:
558.029
SMILES:
CNC(=O)COc1cc2cc(Nc3nc(ncc3Cl)N3CCC(CC3)C(=O)N(C)C)cc(OC)c2n(C)c1=O
: