Target
5'-nucleotidase
Ligand
BDBM50546280
Substrate
Meas. Tech.
ChEMBL_2015111 (CHEMBL4668689)
IC50
0.830000±n/a nM
Citation
 Lawson, KVKalisiak, JLindsey, EANewcomb, ETLeleti, MRDebien, LRosen, BRMiles, DHSharif, EUJeffrey, JLTan, JBLChen, AZhao, SXu, GFu, LJin, LPark, TWBerry, WMoschütz, SScaletti, ESträter, NWalker, NPYoung, SWWalters, MJSchindler, UPowers, JP Discovery of AB680: A Potent and Selective Inhibitor of CD73. J Med Chem 63:11448-11468 (2020)  
Target
Name:
5'-nucleotidase
Synonyms:
3.1.3.5 CD_antigen=CD73 Nt5e | Nte
Type:
PROTEIN
Mol. Mass.:
63864.64
Organism:
Mus musculus
Description:
ChEMBL_120102
Residue:
576
  
Inhibitor
Name:
BDBM50546280
Synonyms:
CHEMBL4761506
Type:
Small organic molecule
Emp. Form.:
C20H24ClFN4O9P2
Mol. Mass.:
580.825
SMILES:
C[C@H](Nc1cc(Cl)nc2n(ncc12)[C@@H]1O[C@H](COP(O)(=O)CP(O)(O)=O)[C@@H](O)[C@H]1O)c1ccc(F)cc1
: