Target
Intercellular adhesion molecule 1
Ligand
BDBM50105156
Substrate
Meas. Tech.
ChEMBL_89063 (CHEMBL697202)
IC50
5±n/a nM
Citation
 Zhu, GDArendsen, DLGunawardana, IWBoyd, SAStewart, AOFry, DGCool, BLKifle, LSchaefer, VMeuth, JMarsh, KCKempf-Grote, AJKilgannon, PGallatin, WMOkasinski, GF Selective inhibition of ICAM-1 and E-selectin expression in human endothelial cells. 2. Aryl modifications of 4-(aryloxy)thieno[2,3-c]pyridines with fine-tuning at C-2 carbamides. J Med Chem 44:3469-87 (2001)  
Target
Name:
Intercellular adhesion molecule 1
Synonyms:
CD_antigen=CD54 ICAM1 Intercellular adhesion molecule (ICAM-1), Integrin alpha-L/beta-2 Intercellular adhesion molecule-1 | Major group rhinovirus receptor
Type:
PROTEIN
Mol. Mass.:
57831.10
Organism:
Homo sapiens (Human)
Description:
ChEMBL_826675
Residue:
532
  
Inhibitor
Name:
BDBM50105156
Synonyms:
4-{4-[2-(2-Methoxy-ethoxy)-ethoxymethyl]-phenoxy}-thieno[2,3-c]pyridine-2-carboxylic acid methylamide | CHEMBL117279
Type:
Small organic molecule
Emp. Form.:
C21H24N2O5S
Mol. Mass.:
416.491
SMILES:
CNC(=O)c1cc2c(Oc3ccc(COCCOCCOC)cc3)cncc2s1
: