Target
Bifunctional epoxide hydrolase 2
Ligand
BDBM50546449
Substrate
Meas. Tech.
ChEMBL_2015743 (CHEMBL4669321)
IC50
0.400000±n/a nM
Citation
 Burmistrov, VMorisseau, CKarlov, DPitushkin, DVernigora, ARasskazova, EButov, GMHammock, BD Bioisosteric substitution of adamantane with bicyclic lipophilic groups improves water solubility of human soluble epoxide hydrolase inhibitors. Bioorg Med Chem Lett 30:0 (2020)  
Target
Name:
Bifunctional epoxide hydrolase 2
Synonyms:
Cytosolic epoxide hydrolase 2 EPHX2 HYES_HUMAN Soluble epoxide hydrolase (sEH) | epoxide hydrolase 2, cytoplasmic
Type:
Enzyme
Mol. Mass.:
62613.07
Organism:
Homo sapiens (Human)
Description:
P34913
Residue:
555
  
Inhibitor
Name:
BDBM50546449
Synonyms:
CHEMBL4746902
Type:
Small organic molecule
Emp. Form.:
C15H17F3N2O2
Mol. Mass.:
314.3029
SMILES:
FC(F)(F)Oc1ccc(NC(=O)NC2CC3CCC2C3)cc1
: