Target
Microtubule-associated protein 2
Ligand
BDBM50547182
Substrate
Meas. Tech.
ChEMBL_2017292 (CHEMBL4670870)
IC50
126±n/a nM
Citation
 Hirst, DJBrandt, MBruton, GChristodoulou, ECutler, LDeeks, NGoodacre, JDJack, TLindon, MMiah, APage, KParr, NShukla, LSims, MThomas, PThorpe, JHolmes, DS Structure-based optimisation of orally active & reversible MetAP-2 inhibitors maintaining a tight 'molecular budget'. Bioorg Med Chem Lett 30:0 (2020)  
Target
Name:
Microtubule-associated protein 2
Synonyms:
MAP-2 MTAP2_HUMAN
Type:
PROTEIN
Mol. Mass.:
199423.64
Organism:
Homo sapiens (Human)
Description:
ChEMBL_107603
Residue:
1827
  
Inhibitor
Name:
BDBM50547182
Synonyms:
CHEMBL4789033
Type:
Small organic molecule
Emp. Form.:
C16H13ClN2O2
Mol. Mass.:
300.74
SMILES:
COc1ccc(cc1)-c1c([nH]c2ccc(Cl)cc12)C(N)=O
: