Target
Muscarinic acetylcholine receptor M1
Ligand
BDBM50004665
Substrate
Meas. Tech.
ChEMBL_138278 (CHEMBL744235)
IC50
2.3±n/a nM
Citation
 Cha, JHCho, YSPae, ANKoh, HYJeong, DKong, JYLee, EChoi, KI Synthesis and In vitro binding affinities of 1-azabicyclic compounds as muscarinic ligands. Bioorg Med Chem Lett 11:2855-7 (2001)  
Target
Name:
Muscarinic acetylcholine receptor M1
Synonyms:
ACM1_HUMAN Cholinergic receptor, muscarinic 1 | Cholinergic, muscarinic M1
Type:
Protein
Mol. Mass.:
51442.54
Organism:
Homo sapiens (Human)
Description:
P11229
Residue:
460
  
Inhibitor
Name:
BDBM50004665
Synonyms:
(oxotremorine)1-(4-Pyrrolidin-1-yl-but-2-ynyl)-pyrrolidin-2-one 1-(4-Pyrrolidin-1-yl-but-2-ynyl)-pyrrolidin-2-one (oxotremorphine) 1-[4-(2-oxo-pyrrolidin-1-yl)-but-2-ynyl]-pyrrolidinium Oxotremorine cid_4630
Type:
Small organic molecule
Emp. Form.:
C12H18N2O
Mol. Mass.:
206.2841
SMILES:
O=C1CCCN1CC#CCN1CCCC1
: