Target
Muscarinic acetylcholine receptor M1
Ligand
BDBM46858
Substrate
Meas. Tech.
ChEMBL_138277 (CHEMBL744234)
IC50
115500±n/a nM
Citation
 Cha, JHCho, YSPae, ANKoh, HYJeong, DKong, JYLee, EChoi, KI Synthesis and In vitro binding affinities of 1-azabicyclic compounds as muscarinic ligands. Bioorg Med Chem Lett 11:2855-7 (2001)  
Target
Name:
Muscarinic acetylcholine receptor M1
Synonyms:
ACM1_HUMAN Cholinergic receptor, muscarinic 1 | Cholinergic, muscarinic M1
Type:
Protein
Mol. Mass.:
51442.54
Organism:
Homo sapiens (Human)
Description:
P11229
Residue:
460
  
Inhibitor
Name:
BDBM46858
Synonyms:
1-methyl-3,6-dihydro-2H-pyridine-5-carboxylic acid methyl ester;hydrobromide ARECOLINE HYDROBROMIDE SMR000058258 cid_9301 | methyl 1-methyl-3,6-dihydro-2H-pyridine-5-carboxylate;hydrobromide
Type:
Small organic molecule
Emp. Form.:
C8H13NO2
Mol. Mass.:
155.1943
SMILES:
COC(=O)C1=CCCN(C)C1
: