Target
Cyclin-dependent kinase 1
Ligand
BDBM15458
Substrate
Meas. Tech.
ChEBML_216729
IC50
>100±n/a nM
Citation
 Adams, JLBoehm, JCGallagher, TFKassis, SWebb, EFHall, RSorenson, MGarigipati, RGriswold, DELee, JC Pyrimidinylimidazole inhibitors of p38: cyclic N-1 imidazole substituents enhance p38 kinase inhibition and oral activity. Bioorg Med Chem Lett 11:2867-70 (2001)  
Target
Name:
Cyclin-dependent kinase 1
Synonyms:
CDC2 CDK1 CDKN1 Cell division protein kinase 1 P34CDC2 | p34 protein kinase
Type:
Enzyme Subunit
Mol. Mass.:
34101.08
Organism:
Homo sapiens (Human)
Description:
P06493
Residue:
297
  
Inhibitor
Name:
BDBM15458
Synonyms:
4-[4-(4-fluorophenyl)-1-(piperidin-4-yl)-1H-imidazol-5-yl]-2-methoxypyrimidine CHEMBL95692 SB242235
Type:
Small organic molecule
Emp. Form.:
C19H20FN5O
Mol. Mass.:
353.3934
SMILES:
COc1nccc(n1)-c1c(ncn1C1CCNCC1)-c1ccc(F)cc1
: