Target
Rho-associated protein kinase 1
Ligand
BDBM50546246
Substrate
Meas. Tech.
ChEMBL_2016261 (CHEMBL4669839)
Ki
0.200000±n/a nM
Citation
 Hu, ZWang, CSitkoff, DCheadle, NLXu, SMuckelbauer, JKAdam, LPWexler, RRQuan, ML Identification of 5H-chromeno[3,4-c]pyridine and 6H-isochromeno[3,4-c]pyridine derivatives as potent and selective dual ROCK inhibitors. Bioorg Med Chem Lett 30:127474 (2020)  
Target
Name:
Rho-associated protein kinase 1
Synonyms:
ROCK-I ROCK1_HUMAN Rho-associated protein kinase Rho-associated, coiled-coil-containing protein kinase 1 Rho-kinase (ROCK I) p160 ROCK-1 | p160ROCK
Type:
Serine/threonine-protein kinase
Mol. Mass.:
158156.77
Organism:
Homo sapiens (Human)
Description:
Q13464
Residue:
1354
  
Inhibitor
Name:
BDBM50546246
Synonyms:
CHEMBL4753043 | US11608319, Compound AR-13503
Type:
Small organic molecule
Emp. Form.:
C19H19N3O2
Mol. Mass.:
321.3731
SMILES:
NC[C@@H](C(=O)Nc1ccc2cnccc2c1)c1ccc(CO)cc1
: