Target
Acetylcholine receptor subunit gamma
Ligand
BDBM50547501
Substrate
Meas. Tech.
ChEMBL_2018489 (CHEMBL4672067)
IC50
7.5±n/a nM
Citation
 Giribaldi, JHaufe, YEvans, ERJAmar, MDurner, ASchmidt, CFaucherre, AMoha Ou Maati, HEnjalbal, CMolgó, JServent, DWilson, DTDaly, NLNicke, ADutertre, S Backbone Cyclization Turns a Venom Peptide into a Stable and Equipotent Ligand at Both Muscle and Neuronal Nicotinic Receptors. J Med Chem 63:12682-12692 (2020)  
Target
Name:
Acetylcholine receptor subunit gamma
Synonyms:
ACHG_RAT Achrg | Chrng
Type:
PROTEIN
Mol. Mass.:
58622.01
Organism:
Rattus norvegicus
Description:
ChEMBL_119375
Residue:
519
  
Inhibitor
Name:
BDBM50547501
Synonyms:
CHEMBL4788244
Type:
Small organic molecule
Emp. Form.:
C69H100N26O19S4
Mol. Mass.:
1725.955
SMILES:
[H][C@@]12CCCN1C(=O)[C@H](Cc1c[nH]cn1)NC(=O)[C@@H]1CSSC[C@@H]3NC(=O)[C@H](CO)NC(=O)[C@H](Cc4ccccc4)NC(=O)[C@H](Cc4c[nH]cn4)NC(=O)[C@H](CCCCN)NC(=O)CNC(=O)[C@H](CSSC[C@H](NC(=O)[C@H](CCCNC(N)=N)NC(=O)CNC(=O)[C@H](CC(N)=O)NC(=O)CNC(=O)[C@H](C)NC3=O)C(=O)N1)NC(=O)[C@H](C)NC2=O
: