Target
Muscarinic acetylcholine receptor M2
Ligand
BDBM50106486
Substrate
Meas. Tech.
ChEMBL_139641 (CHEMBL748254)
Ki
9.2±n/a nM
Citation
 Melchiorre, CBolognesi, MLBudriesi, RGhelardini, CChiarini, AMinarini, ARosini, MTumiatti, VWade, EJ Design, synthesis, and biological activity of methoctramine-related polyamines as putative G(i) protein activators. J Med Chem 44:4035-8 (2001)  
Target
Name:
Muscarinic acetylcholine receptor M2
Synonyms:
ACM2_HUMAN Cholinergic, muscarinic M2 Muscarinic acetylcholine receptor M2 and M5 | RecName: Full=Muscarinic acetylcholine receptor M2
Type:
GPCR
Mol. Mass.:
51730.61
Organism:
Homo sapiens (Human)
Description:
P08172
Residue:
466
  
Inhibitor
Name:
BDBM50106486
Synonyms:
1,8-Bis-[1'-(2-methoxy-benzyl)-[4,4']bipiperidinyl-1-yl]-octane-1,8-dione | CHEMBL130835
Type:
Small organic molecule
Emp. Form.:
C44H66N4O4
Mol. Mass.:
715.0192
SMILES:
COc1ccccc1CN1CCC(CC1)C1CCN(CC1)C(=O)CCCCCCC(=O)N1CCC(CC1)C1CCN(Cc2ccccc2OC)CC1
: