Target
Muscarinic acetylcholine receptor M3
Ligand
BDBM50106485
Substrate
Meas. Tech.
ChEMBL_138697 (CHEMBL747664)
Ki
422.0±n/a nM
Citation
 Melchiorre, CBolognesi, MLBudriesi, RGhelardini, CChiarini, AMinarini, ARosini, MTumiatti, VWade, EJ Design, synthesis, and biological activity of methoctramine-related polyamines as putative G(i) protein activators. J Med Chem 44:4035-8 (2001)  
Target
Name:
Muscarinic acetylcholine receptor M3
Synonyms:
ACM3_HUMAN Cholinergic, muscarinic M3 Muscarinic receptor M3 | RecName: Full=Muscarinic acetylcholine receptor M3
Type:
Enzyme
Mol. Mass.:
66151.03
Organism:
Homo sapiens (Human)
Description:
P20309
Residue:
590
  
Inhibitor
Name:
BDBM50106485
Synonyms:
1'-[8-(1-(2-methoxy-benzyl)-[4,4']bipiperidinyl)-octyl]-1-(2-methoxy-benzyl)-[4,4']bipiperidinyl | CHEMBL127273
Type:
Small organic molecule
Emp. Form.:
C44H70N4O2
Mol. Mass.:
687.0522
SMILES:
COc1ccccc1CN1CCC(CC1)C1CCN(CCCCCCCCN2CCC(CC2)C2CCN(Cc3ccccc3OC)CC2)CC1
: