Target
Carbonic anhydrase 1
Ligand
BDBM50331833
Substrate
Meas. Tech.
ChEMBL_2018971 (CHEMBL4672549)
Ki
67±n/a nM
Citation
 Andring, JTFouch, MAkocak, SAngeli, ASupuran, CTIlies, MAMcKenna, R Structural Basis of Nanomolar Inhibition of Tumor-Associated Carbonic Anhydrase IX: X-Ray Crystallographic and Inhibition Study of Lipophilic Inhibitors with Acetazolamide Backbone. J Med Chem 63:13064-13075 (2020)  
Target
Name:
Carbonic anhydrase 1
Synonyms:
CA-I CAB Carbonate dehydratase I Carbonic anhydrase 1 (CA I) Carbonic anhydrase 1 (Recombinant CA I) Carbonic anhydrase B Carbonic anhydrase I (CA I) Carbonic anhydrase I (CAI) Carbonic anhydrase isoenzyme I (hCA I) | hCA
Type:
Enzyme
Mol. Mass.:
28873.37
Organism:
Homo sapiens (Human)
Description:
P00915
Residue:
261
  
Inhibitor
Name:
BDBM50331833
Synonyms:
5-propylamido-2-sulfamoyl-1,3,4-thiadiazole | CHEMBL1288786
Type:
Small organic molecule
Emp. Form.:
C5H8N4O3S2
Mol. Mass.:
236.272
SMILES:
CCC(=O)Nc1nnc(s1)S(N)(=O)=O
: