Target
Carbonic anhydrase 4
Ligand
BDBM16668
Substrate
Meas. Tech.
ChEMBL_2018973 (CHEMBL4672551)
Ki
0.430000±n/a nM
Citation
 Andring, JTFouch, MAkocak, SAngeli, ASupuran, CTIlies, MAMcKenna, R Structural Basis of Nanomolar Inhibition of Tumor-Associated Carbonic Anhydrase IX: X-Ray Crystallographic and Inhibition Study of Lipophilic Inhibitors with Acetazolamide Backbone. J Med Chem 63:13064-13075 (2020)  
Target
Name:
Carbonic anhydrase 4
Synonyms:
CA-IV CAH4_HUMAN Carbonic anhydrase Carbonic anhydrase IV (CA IV)
Type:
Enzyme
Mol. Mass.:
35037.98
Organism:
Homo sapiens (Human)
Description:
P22748
Residue:
312
  
Inhibitor
Name:
BDBM16668
Synonyms:
2,2-dimethyl-N-(5-sulfamoyl-1,3,4-thiadiazol-2-yl)propanamide heterocyclic sulfonamide compound 33
Type:
Small organic molecule
Emp. Form.:
C7H12N4O3S2
Mol. Mass.:
264.325
SMILES:
CC(C)(C)C(=O)Nc1nnc(s1)S(N)(=O)=O
: