Target
Carbonic anhydrase 9
Ligand
BDBM16668
Substrate
Meas. Tech.
ChEMBL_2018974 (CHEMBL4672552)
Ki
8.2±n/a nM
Citation
 Andring, JTFouch, MAkocak, SAngeli, ASupuran, CTIlies, MAMcKenna, R Structural Basis of Nanomolar Inhibition of Tumor-Associated Carbonic Anhydrase IX: X-Ray Crystallographic and Inhibition Study of Lipophilic Inhibitors with Acetazolamide Backbone. J Med Chem 63:13064-13075 (2020)  
Target
Name:
Carbonic anhydrase 9
Synonyms:
CA-IX CAH9_HUMAN Carbonic anhydrase 9 (CA IX) Carbonic anhydrase 9 precursor Carbonic anhydrase IX (CAIX) Carbonic anhydrases; II & IX MN RCC-associated antigen G250
Type:
Enzyme
Mol. Mass.:
49669.03
Organism:
Homo sapiens (Human)
Description:
Catalytic domain of human cloned isozyme was used in the assay
Residue:
459
  
Inhibitor
Name:
BDBM16668
Synonyms:
2,2-dimethyl-N-(5-sulfamoyl-1,3,4-thiadiazol-2-yl)propanamide heterocyclic sulfonamide compound 33
Type:
Small organic molecule
Emp. Form.:
C7H12N4O3S2
Mol. Mass.:
264.325
SMILES:
CC(C)(C)C(=O)Nc1nnc(s1)S(N)(=O)=O
: