Target
Glutathione reductase, mitochondrial
Ligand
BDBM50096062
Substrate
Meas. Tech.
ChEMBL_72474 (CHEMBL685507)
IC50
1000±n/a nM
Citation
 Davioud-Charvet, EDelarue, SBiot, CSchwöbel, BBoehme, CCMüssigbrodt, AMaes, LSergheraert, CGrellier, PSchirmer, RHBecker, K A prodrug form of a Plasmodium falciparum glutathione reductase inhibitor conjugated with a 4-anilinoquinoline. J Med Chem 44:4268-76 (2001)  
Target
Name:
Glutathione reductase, mitochondrial
Synonyms:
GLUR GSHR_HUMAN Glutathione reductase | Glutathione reductase (GR)
Type:
Enzyme
Mol. Mass.:
56271.52
Organism:
Homo sapiens (Human)
Description:
P00390
Residue:
522
  
Inhibitor
Name:
BDBM50096062
Synonyms:
5-(8-Hydroxy-3-methyl-1,4-dioxo-1,4-dihydro-naphthalen-2-yl)-pentanoic acid | CHEMBL135504
Type:
Small organic molecule
Emp. Form.:
C16H16O5
Mol. Mass.:
288.2952
SMILES:
Cc1c(O)c2cccc(O)c2c(O)c1C=CCCC(O)=O
: