Target
Cyclin-dependent kinase 2/G1/S-specific cyclin-E1
Ligand
BDBM498319
Substrate
Meas. Tech.
ChEMBL_2019378 (CHEMBL4672956)
Ki
0.100000±n/a nM
Citation
 Sabnis, RW Novel CDK2 Inhibitors for Treating Cancer. ACS Med Chem Lett 11:2346-2347 (2020)  
Target
Name:
Cyclin-dependent kinase 2/G1/S-specific cyclin-E1
Synonyms:
CDK2/CycE CDK2/E Cyclin-Dependent Kinase 2 (CDK2) Cyclin-dependent kinase 2/cyclin E1
Type:
Protein
Mol. Mass.:
Description:
Components:
This complex has 2 components.
Component 1
Name:
Cyclin-dependent kinase 2
Synonyms:
CDK2 CDK2_HUMAN Cell division protein kinase 2 Protein cereblon/Cyclin-dependent kinase 2 | p33 protein kinase
Type:
Enzyme Subunit
Mol. Mass.:
33938.17
Organism:
Homo sapiens (Human)
Description:
P24941
Residue:
298
  
Component 2
Name:
G1/S-specific cyclin-E1
Synonyms:
CCNE CCNE1_HUMAN
Type:
Enzyme Subunit
Mol. Mass.:
47073.17
Organism:
Homo sapiens (Human)
Description:
Residue:
410
  
Inhibitor
Name:
BDBM498319
Synonyms:
US11014911, Example 144 | US11718603, Example 144
Type:
Small organic molecule
Emp. Form.:
C22H29N5O4
Mol. Mass.:
427.4968
SMILES:
COc1ccc(CC(=O)Nc2cc([nH]n2)[C@H]2CC[C@H](C2)OC(=O)N2CCC2(C)C)cn1
: