Target
Transporter
Ligand
BDBM50106856
Substrate
Meas. Tech.
ChEBML_142968
Ki
173±n/a nM
Citation
 Gu, XHZong, RKula, NSBaldessarini, RJNeumeyer, JL Synthesis and biological evaluation of a series of novel N- or O-fluoroalkyl derivatives of tropane: potential positron emission tomography (PET) imaging agents for the dopamine transporter. Bioorg Med Chem Lett 11:3049-53 (2001)  
Target
Name:
Transporter
Synonyms:
Monoamine transporters; Norepininephrine & dopamine | Norepinephrine Monoamine transporters
Type:
PROTEIN
Mol. Mass.:
66787.87
Organism:
Rattus norvegicus
Description:
ChEMBL_1463061
Residue:
597
  
Inhibitor
Name:
BDBM50106856
Synonyms:
3-(4-Iodo-phenyl)-8-methyl-8-aza-bicyclo[3.2.1]octane-2-carboxylic acid 2-fluoro-ethyl ester | CHEMBL318961
Type:
Small organic molecule
Emp. Form.:
C17H21FINO2
Mol. Mass.:
417.257
SMILES:
CN1C2CCC1C(C(C2)c1ccc(I)cc1)C(=O)OCCF
: