Target
Sodium-dependent serotonin transporter
Ligand
BDBM50106859
Substrate
Meas. Tech.
ChEBML_201799
Ki
325±n/a nM
Citation
 Gu, XHZong, RKula, NSBaldessarini, RJNeumeyer, JL Synthesis and biological evaluation of a series of novel N- or O-fluoroalkyl derivatives of tropane: potential positron emission tomography (PET) imaging agents for the dopamine transporter. Bioorg Med Chem Lett 11:3049-53 (2001)  
Target
Name:
Sodium-dependent serotonin transporter
Synonyms:
5-HT Transporter 5HT transporter Anandamid membrane transporter, AMT Monoamine transporters; Norepinephrine & serotonin Slc6a4 Sodium-dependent serotonin transporter (SERT) | imipramine receptor
Type:
Multi-pass membrane protein
Mol. Mass.:
70168.43
Organism:
Rattus norvegicus (rat)
Description:
P31652
Residue:
630
  
Inhibitor
Name:
BDBM50106859
Synonyms:
8-Methyl-3-p-tolyl-8-aza-bicyclo[3.2.1]octane-2-carboxylic acid 3-fluoro-propyl ester | CHEMBL430504
Type:
Small organic molecule
Emp. Form.:
C19H26FNO2
Mol. Mass.:
319.4136
SMILES:
CN1C2CCC1C(C(C2)c1ccc(C)cc1)C(=O)OCCCF
: