Target
Protein kinase C alpha type
Ligand
BDBM50085904
Substrate
Meas. Tech.
ChEMBL_152973 (CHEMBL760366)
Ki
2.9±n/a nM
Citation
 Lee, JHan, KCKang, JHPearce, LLLewin, NEYan, SBenzaria, SNicklaus, MCBlumberg, PMMarquez, VE Conformationally constrained analogues of diacylglycerol. 18. The incorporation of a hydroxamate moiety into diacylglycerol-lactones reduces lipophilicity and helps discriminate between sn-1 and sn-2 binding modes to protein kinase C (PK-C). Implications for isozyme specificity. J Med Chem 44:4309-12 (2001)  
Target
Name:
Protein kinase C alpha type
Synonyms:
KPCA_HUMAN PKC alpha and beta-2 PKC-alpha PRKACA Protein Kinase C- alpha Protein kinase C alpha (PKCa) Protein kinase C alpha type (PRKCA) RAF proto-oncogene serine/threonine-protein kinase
Type:
Enzyme
Mol. Mass.:
76755.65
Organism:
Homo sapiens (Human)
Description:
The recombinant human PKC enzymes were produced using a baculovirus expression system in SF9 cells
Residue:
672
  
Inhibitor
Name:
BDBM50085904
Synonyms:
3-Isopropyl-4-methyl-pentanoic acid 2-hydroxymethyl-4-(3-isopropyl-4-methyl-pentylidene)-5-oxo-tetrahydro-furan-2-ylmethyl ester CHEMBL290876
Type:
Small organic molecule
Emp. Form.:
C24H42O5
Mol. Mass.:
410.5873
SMILES:
CC(C)C(C\C=C1\CC(CO)(COC(=O)CC(C(C)C)C(C)C)OC1=O)C(C)C
: