Target
D(2) dopamine receptor
Ligand
BDBM50107240
Substrate
Meas. Tech.
ChEMBL_62392 (CHEMBL672344)
Ki
>850±n/a nM
Citation
 Perrone, RBerardi, FColabufo, NALeopoldo, MLacivita, ETortorella, VLeonardi, APoggesi, ETesta, R trans-4-[4-(Methoxyphenyl)cyclohexyl]-1-arylpiperazines: a new class of potent and selective 5-HT(1A) receptor ligands as conformationally constrained analogues of 4-[3-(5-methoxy-1,2,3,4-tetrahydronaphthalen-1-yl)propyl]-1-arylpiperazines. J Med Chem 44:4431-42 (2001)  
Target
Name:
D(2) dopamine receptor
Synonyms:
DOPAMINE D2 DOPAMINE D2 Short Dopamine D2 receptor Drd2
Type:
G Protein-Coupled Receptor (GPCR)
Mol. Mass.:
50931.60
Organism:
Rattus norvegicus (rat)
Description:
P61169
Residue:
444
  
Inhibitor
Name:
BDBM50107240
Synonyms:
CHEMBL344432 | [3-(5-Methoxy-1,2,3,4-tetrahydro-naphthalen-1-yl)-propyl]-[2-(pyridin-2-yloxy)-ethyl]-amine
Type:
Small organic molecule
Emp. Form.:
C21H28N2O2
Mol. Mass.:
340.4592
SMILES:
COc1cccc2C(CCCNCCOc3ccccn3)CCCc12
: