Target
Ghrelin O-acyltransferase
Ligand
BDBM50548066
Substrate
Meas. Tech.
ChEMBL_2019854 (CHEMBL4673667)
IC50
3.3±n/a nM
Citation
 Iyer, MRWood, CMKunos, G Recent progress in the discovery of ghrelin  RSC Med Chem 11:1136-1144 (2020)  
Target
Name:
Ghrelin O-acyltransferase
Synonyms:
2.3.1.- Gm171 MBOA4_MOUSE Membrane-bound O-acyltransferase domain-containing protein 4 | O-acyltransferase domain-containing protein 4
Type:
PROTEIN
Mol. Mass.:
49896.50
Organism:
Mus musculus
Description:
ChEMBL_103545
Residue:
435
  
Inhibitor
Name:
BDBM50548066
Synonyms:
CHEMBL4791105
Type:
Small organic molecule
Emp. Form.:
C15H9Cl2NO3S
Mol. Mass.:
354.208
SMILES:
OC(=O)c1ccc2oc(SCc3ccc(Cl)cc3Cl)nc2c1
: