Target
Cystathionine gamma-lyase
Ligand
BDBM50548267
Substrate
Meas. Tech.
ChEMBL_2021480 (CHEMBL4675293)
IC50
6200±n/a nM
Citation
 Hu, YWang, LHan, XZhou, YZhang, TWang, LHong, TZhang, WGuo, XXSun, JQi, YYu, JLiu, HWu, F Discovery of a Bioactive Inhibitor with a New Scaffold for Cystathionine ?-Lyase. J Med Chem 62:1677-1683 (2019)  
Target
Name:
Cystathionine gamma-lyase
Synonyms:
CGL_HUMAN Cystathionine gamma-lyase (CSE) Gamma-cystathionase
Type:
Protein
Mol. Mass.:
44509.52
Organism:
Homo sapiens (Human)
Description:
P32929
Residue:
405
  
Inhibitor
Name:
BDBM50548267
Synonyms:
CHEMBL4761159
Type:
Small organic molecule
Emp. Form.:
C17H16O6
Mol. Mass.:
316.3053
SMILES:
COc1cccc2C(=O)C3=C([C@H](C)O[C@@H](CC(O)=O)C3)C(=O)c12
: