Target
Cystathionine gamma-lyase
Ligand
BDBM64987
Substrate
Meas. Tech.
ChEMBL_2021492 (CHEMBL4675305)
IC50
8000±n/a nM
Citation
 Hu, YWang, LHan, XZhou, YZhang, TWang, LHong, TZhang, WGuo, XXSun, JQi, YYu, JLiu, HWu, F Discovery of a Bioactive Inhibitor with a New Scaffold for Cystathionine ?-Lyase. J Med Chem 62:1677-1683 (2019)  
Target
Name:
Cystathionine gamma-lyase
Synonyms:
CGL_HUMAN Cystathionine gamma-lyase (CSE) Gamma-cystathionase
Type:
Protein
Mol. Mass.:
44509.52
Organism:
Homo sapiens (Human)
Description:
P32929
Residue:
405
  
Inhibitor
Name:
BDBM64987
Synonyms:
5-nitro-8-quinolinol 8-HYDROXY-5-NITROQUINOLINE SMR000059036 nitroxoline
Type:
Small organic molecule
Emp. Form.:
C9H6N2O3
Mol. Mass.:
190.1555
SMILES:
Oc1ccc([N+]([O-])=O)c2cccnc12
: