Target
Adenosine receptor A2a
Ligand
BDBM50108018
Substrate
Meas. Tech.
ChEMBL_31502 (CHEMBL647487)
Ki
0.22±n/a nM
Citation
 Baraldi, PGCacciari, BRomagnoli, RSpalluto, GMonopoli, AOngini, EVarani, KBorea, PA 7-Substituted 5-amino-2-(2-furyl)pyrazolo[4,3-e]-1,2,4-triazolo[1,5-c]pyrimidines as A2A adenosine receptor antagonists: a study on the importance of modifications at the side chain on the activity and solubility. J Med Chem 45:115-26 (2001)  
Target
Name:
Adenosine receptor A2a
Synonyms:
A2A adenosine receptor (hA2A) ADENOSINE A2 ADORA2 Adenosine A2A receptor (A2AAR)
Type:
G Protein-Coupled Receptor (GPCR)
Mol. Mass.:
44716.46
Organism:
Homo sapiens (Human)
Description:
P29274
Residue:
412
  
Inhibitor
Name:
BDBM50108018
Synonyms:
7-(3-(4-aminophenyl)propyl)-2-(furan-2-yl)-7H-pyrazolo[4,3-e][1,2,4]triazolo[1,5-c]pyrimidin-5-amine CHEMBL281805
Type:
Small organic molecule
Emp. Form.:
C19H18N8O
Mol. Mass.:
374.3992
SMILES:
Nc1ccc(CCCn2ncc3c2nc(N)n2nc(nc32)-c2ccco2)cc1
: