Target
Integrin alpha-4/beta-1
Ligand
BDBM50108215
Substrate
Meas. Tech.
ChEMBL_217306 (CHEMBL823927)
IC50
0.100000±n/a nM
Citation
 Lin, LSLanza, TMcCauley, EVan Riper, GKidambi, UCao, JEgger, LAMumford, RASchmidt, JAMacCoss, MHagmann, WK Specific and dual antagonists of alpha(4)beta(1) and alpha(4)beta(7) integrins. Bioorg Med Chem Lett 12:133-6 (2001)  
Target
Name:
Integrin alpha-4/beta-1
Synonyms:
Fibronectin receptor beta/Integrin alpha-4 | Integrin alpha-4/beta-1
Type:
Mol. Mass.:
Description:
ASSAY_ID of EBI is 88912
Components:
This complex has 2 components.
Component 1
Name:
Integrin beta-1
Synonyms:
CD_antigen=CD29 Fibronectin receptor beta GPIIA ITGB1 MDF2 | MSK12
Type:
Enzyme
Mol. Mass.:
88400.38
Organism:
Homo sapiens (Human)
Description:
P05556
Residue:
798
  
Component 2
Name:
Integrin alpha-4
Synonyms:
CD49 antigen-like family member D CD49d antigen ITA4_HUMAN Integrin alpha-4 Integrin alpha-IV VLA-4 integrin alpha 4 precursor | integrin alpha-4 precursor
Type:
Membrane Protein
Mol. Mass.:
114897.35
Organism:
Homo sapiens (Human)
Description:
P13612
Residue:
1032
  
Inhibitor
Name:
BDBM50108215
Synonyms:
(S)-3-(2'-Cyano-biphenyl-4-yl)-2-{[(2S,3S)-1-(3,5-dichloro-benzenesulfonyl)-3-hydroxy-pyrrolidine-2-carbonyl]-amino}-propionic acid | CHEMBL430931
Type:
Small organic molecule
Emp. Form.:
C27H23Cl2N3O6S
Mol. Mass.:
588.459
SMILES:
O[C@H]1CCN([C@@H]1C(=O)N[C@@H](Cc1ccc(cc1)-c1ccccc1C#N)C(O)=O)S(=O)(=O)c1cc(Cl)cc(Cl)c1
: