Target
Calcium release-activated calcium channel protein/Stromal interaction molecule 1
Ligand
BDBM50018011
Substrate
Meas. Tech.
ChEMBL_2024560 (CHEMBL4678373)
IC50
4300±n/a nM
Citation
 Serafini, MCordero-Sanchez, CDi Paola, RBhela, IPAprile, SPurghè, BFusco, RCuzzocrea, SGenazzani, AARiva, BPirali, T Store-Operated Calcium Entry as a Therapeutic Target in Acute Pancreatitis: Discovery and Development of Drug-Like SOCE Inhibitors. J Med Chem 63:14761-14779 (2020)  
Target
Name:
Calcium release-activated calcium channel protein/Stromal interaction molecule 1
Synonyms:
ORAI1/STIM1
Type:
Mol. Mass.:
Description:
ASSAY_ID of ChEMBL is 2024560
Components:
This complex has 2 components.
Component 1
Name:
Calcium release-activated calcium channel protein 1
Synonyms:
CRACM1 Calcium channel (VER) Calcium release-activated calcium channel protein 1 Protein orai-1 Transmembrane protein 142A
Type:
Protein
Mol. Mass.:
32676.63
Organism:
Homo sapiens (Human)
Description:
Q96D31
Residue:
301
  
Component 2
Name:
Stromal interaction molecule 1
Synonyms:
GOK STIM1_HUMAN | Stromal interaction molecule 1
Type:
PROTEIN
Mol. Mass.:
77425.50
Organism:
Homo sapiens
Description:
ChEMBL_118315
Residue:
685
  
Inhibitor
Name:
BDBM50018011
Synonyms:
Aubagio HMR-1726 | TERIFLUNOMIDE
Type:
Small organic molecule
Emp. Form.:
C12H9F3N2O2
Mol. Mass.:
270.2073
SMILES:
C\C(O)=C(/C#N)C(=O)Nc1ccc(cc1)C(F)(F)F
: