Target
Rho-associated protein kinase 1
Ligand
BDBM50549386
Substrate
Meas. Tech.
ChEMBL_2024616 (CHEMBL4678429)
Ki
3.0±n/a nM
Citation
 Bandarage, UKCourt, JGao, HNanthakumar, SCome, JHGiroux, SGreen, J ROCK inhibitors 4: Structure-activity relationship studies of 7-azaindole-based rho kinase (ROCK) inhibitors. Bioorg Med Chem Lett 33:0 (2021)  
Target
Name:
Rho-associated protein kinase 1
Synonyms:
ROCK-I ROCK1_HUMAN Rho-associated protein kinase Rho-associated, coiled-coil-containing protein kinase 1 Rho-kinase (ROCK I) p160 ROCK-1 | p160ROCK
Type:
Serine/threonine-protein kinase
Mol. Mass.:
158156.77
Organism:
Homo sapiens (Human)
Description:
Q13464
Residue:
1354
  
Inhibitor
Name:
BDBM50549386
Synonyms:
CHEMBL4778806
Type:
Small organic molecule
Emp. Form.:
C26H28FN5O2S
Mol. Mass.:
493.596
SMILES:
Fc1ccnc2[nH]cc(-c3csc(NC(=O)Cc4cccc(OCCCC5CCNCC5)c4)n3)c12
: