Target
Rho-associated protein kinase 1
Ligand
BDBM50463491
Substrate
Meas. Tech.
ChEMBL_2024616 (CHEMBL4678429)
Ki
6.0±n/a nM
Citation
 Bandarage, UKCourt, JGao, HNanthakumar, SCome, JHGiroux, SGreen, J ROCK inhibitors 4: Structure-activity relationship studies of 7-azaindole-based rho kinase (ROCK) inhibitors. Bioorg Med Chem Lett 33:0 (2021)  
Target
Name:
Rho-associated protein kinase 1
Synonyms:
ROCK-I ROCK1_HUMAN Rho-associated protein kinase Rho-associated, coiled-coil-containing protein kinase 1 Rho-kinase (ROCK I) p160 ROCK-1 | p160ROCK
Type:
Serine/threonine-protein kinase
Mol. Mass.:
158156.77
Organism:
Homo sapiens (Human)
Description:
Q13464
Residue:
1354
  
Inhibitor
Name:
BDBM50463491
Synonyms:
CHEMBL4245197
Type:
Small organic molecule
Emp. Form.:
C25H28N6O2S
Mol. Mass.:
476.594
SMILES:
CN1CCN(CCOc2cccc(CC(=O)Nc3nc(cs3)-c3c[nH]c4ncccc34)c2)CC1
: