Target
Long-chain-fatty-acid--CoA ligase 1
Ligand
BDBM50549482
Substrate
Meas. Tech.
ChEMBL_2024886 (CHEMBL4678699)
IC50
45±n/a nM
Citation
 Hayashi, KKondo, NOmori, NYoshimoto, RHato, MShigaki, SNagasawa, AIto, MOkuno, T Discovery of a benzimidazole series as the first highly potent and selective ACSL1 inhibitors. Bioorg Med Chem Lett 33:0 (2021)  
Target
Name:
Long-chain-fatty-acid--CoA ligase 1
Synonyms:
6.2.1.15 6.2.1.3 ACSL1 Acyl-CoA synthetase 1 FACL1 LACS LACS 2 LACS2 Long-chain acyl-CoA synthetase 2 Long-chain-fatty-acid--CoA ligase 1 Palmitoyl-CoA ligase 2 Synonyms=FACL1
Type:
PROTEIN
Mol. Mass.:
77946.51
Organism:
Homo sapiens
Description:
ChEMBL_117991
Residue:
698
  
Inhibitor
Name:
BDBM50549482
Synonyms:
CHEMBL4755109
Type:
Small organic molecule
Emp. Form.:
C23H26N2O3
Mol. Mass.:
378.4641
SMILES:
Cc1n(Cc2cccc(C)c2)nc2cc(O[C@H]3CC[C@H](CC3)C(O)=O)ccc12
: