Target
Cyclin-dependent kinase 6/G1/S-specific cyclin-D1
Ligand
BDBM467012
Substrate
Meas. Tech.
ChEMBL_2026018 (CHEMBL4679831)
Ki
0.130000±n/a nM
Citation
 Abdel-Magid, AF Potential of Cyclin-Dependent Kinase Inhibitors as Cancer Therapy. ACS Med Chem Lett 12:182-184 (2021)  
Target
Name:
Cyclin-dependent kinase 6/G1/S-specific cyclin-D1
Synonyms:
CDK6/cyclin D1 | Cyclin-dependent kinase 6/G1/S-specific cyclin D1
Type:
Mol. Mass.:
Description:
ASSAY_ID of ChEMBL is 1935149
Components:
This complex has 2 components.
Component 1
Name:
G1/S-specific cyclin-D1
Synonyms:
B-cell lymphoma 1 protein BCL-1 oncogene CCND1 PRAD1 | PRAD1 oncogene
Type:
Enzyme Subunit
Mol. Mass.:
33717.70
Organism:
Homo sapiens (Human)
Description:
Residue:
295
  
Component 2
Name:
Cyclin-dependent kinase 6
Synonyms:
CDK6 CDKN6 Cyclin-dependent kinase 6 (CDK 6) | Serine/threonine-protein kinase PLSTIRE
Type:
Enzyme Subunit
Mol. Mass.:
36937.42
Organism:
Homo sapiens (Human)
Description:
Q00534
Residue:
326
  
Inhibitor
Name:
BDBM467012
Synonyms:
(+)-6-(2,2-difluoroethyl)-8-[(1R*,2R*)-2-hydroxy-2-methylcyclopentyl]-2-{[1-(methylsulfonyl)piperidin-4-yl]amino}pyrido[2,3-d]pyrimidin-7(8H)-one US11396512, Example 7
Type:
Small organic molecule
Emp. Form.:
C21H29F2N5O4S
Mol. Mass.:
485.548
SMILES:
C[C@]1(O)CCC[C@@H]1n1c2nc(NC3CCN(CC3)S(C)(=O)=O)ncc2cc(CC(F)F)c1=O
: