Target
Cyclin-dependent kinase 2/G1/S-specific cyclin-E1
Ligand
BDBM370296
Substrate
Meas. Tech.
ChEMBL_2026019 (CHEMBL4679832)
Ki
0.100000±n/a nM
Citation
 Abdel-Magid, AF Potential of Cyclin-Dependent Kinase Inhibitors as Cancer Therapy. ACS Med Chem Lett 12:182-184 (2021)  
Target
Name:
Cyclin-dependent kinase 2/G1/S-specific cyclin-E1
Synonyms:
CDK2/CycE CDK2/E Cyclin-Dependent Kinase 2 (CDK2) Cyclin-dependent kinase 2/cyclin E1
Type:
Protein
Mol. Mass.:
Description:
Components:
This complex has 2 components.
Component 1
Name:
Cyclin-dependent kinase 2
Synonyms:
CDK2 CDK2_HUMAN Cell division protein kinase 2 Protein cereblon/Cyclin-dependent kinase 2 | p33 protein kinase
Type:
Enzyme Subunit
Mol. Mass.:
33938.17
Organism:
Homo sapiens (Human)
Description:
P24941
Residue:
298
  
Component 2
Name:
G1/S-specific cyclin-E1
Synonyms:
CCNE CCNE1_HUMAN
Type:
Enzyme Subunit
Mol. Mass.:
47073.17
Organism:
Homo sapiens (Human)
Description:
Residue:
410
  
Inhibitor
Name:
BDBM370296
Synonyms:
BDBM467191 | US10233188, Example 183
Type:
Small organic molecule
Emp. Form.:
C18H26N6O4S
Mol. Mass.:
422.502
SMILES:
C[C@@]1(O)CCC[C@H]1n1c2nc(NC3CCN(CC3)S(N)(=O)=O)ncc2ccc1=O
: