Target
Urokinase-type plasminogen activator
Ligand
BDBM50099921
Substrate
Meas. Tech.
ChEBML_212981
Ki
101±n/a nM
Citation
 Rudolph, MJIllig, CRSubasinghe, NLWilson, KJHoffman, JBRandle, TGreen, DMolloy, CJSoll, RMLewandowski, FZhang, MBone, RSpurlino, JCDeckman, ICManthey, CSharp, CMaguire, DGrasberger, BLDesJarlais, RLZhou, Z Design and synthesis of 4,5-disubstituted-thiophene-2-amidines as potent urokinase inhibitors. Bioorg Med Chem Lett 12:491-5 (2002)  
Target
Name:
Urokinase-type plasminogen activator
Synonyms:
PLAU UROK_HUMAN Urokinase-type plasminogen activator (uPA) | Urokinase-type plasminogen activator/surface receptor
Type:
Enzyme
Mol. Mass.:
48528.62
Organism:
Homo sapiens (Human)
Description:
P00749
Residue:
431
  
Inhibitor
Name:
BDBM50099921
Synonyms:
5-Methylsulfanyl-4-(4-phenyl-thiazol-2-yl)-thiophene-2-carboxamidine | CHEMBL281899
Type:
Small organic molecule
Emp. Form.:
C15H13N3S3
Mol. Mass.:
331.479
SMILES:
CSc1sc(cc1-c1nc(cs1)-c1ccccc1)C(N)=N
: