Target
Adenosine receptor A2a
Ligand
BDBM50109445
Substrate
Meas. Tech.
ChEMBL_31663 (CHEMBL649003)
Ki
30±n/a nM
Citation
 Baraldi, PGCacciari, BMoro, SSpalluto, GPastorin, GDa Ros, TKlotz, KNVarani, KGessi, SBorea, PA Synthesis, biological activity, and molecular modeling investigation of new pyrazolo[4,3-e]-1,2,4-triazolo[1,5-c]pyrimidine derivatives as human A(3) adenosine receptor antagonists. J Med Chem 45:770-80 (2002)  
Target
Name:
Adenosine receptor A2a
Synonyms:
A2A adenosine receptor (hA2A) ADENOSINE A2 ADORA2 Adenosine A2A receptor (A2AAR)
Type:
G Protein-Coupled Receptor (GPCR)
Mol. Mass.:
44716.46
Organism:
Homo sapiens (Human)
Description:
P29274
Residue:
412
  
Inhibitor
Name:
BDBM50109445
Synonyms:
1-(8-Ethyl-2-furan-2-yl-8H-pyrazolo[4,3-e][1,2,4]triazolo[1,5-c]pyrimidin-5-yl)-3-p-tolyl-urea CHEMBL348975
Type:
Small organic molecule
Emp. Form.:
C20H18N8O2
Mol. Mass.:
402.4093
SMILES:
CCn1cc2c(n1)nc(NC(=O)Nc1ccc(C)cc1)n1nc(nc21)-c1ccco1
: