Target
Prostaglandin G/H synthase 1
Ligand
BDBM50029593
Substrate
Meas. Tech.
ChEBML_158937
IC50
3000±n/a nM
Citation
 Barbey, SGoossens, LTaverne, TCornet, JChoesmel, VRouaud, CGimeno, GYannic-Arnoult, SMichaux, CCharlier, CHoussin, RHénichart, JP Synthesis and activity of a new methoxytetrahydropyran derivative as dual cyclooxygenase-2/5-lipoxygenase inhibitor. Bioorg Med Chem Lett 12:779-82 (2002)  
Target
Name:
Prostaglandin G/H synthase 1
Synonyms:
COX-1 Cyclooxygenase Cyclooxygenase-1 (COX-1) PTGS1 | Prostaglandin G/H synthase (cyclooxygenase)
Type:
Enzyme
Mol. Mass.:
68692.62
Organism:
Homo sapiens (Human)
Description:
P23219
Residue:
599
  
Inhibitor
Name:
BDBM50029593
Synonyms:
CHEMBL7162 N-(2-Cyclohexyloxy-4-nitro-phenyl)-methanesulfonamide N-[2-(cyclohexyloxy)-4-nitrophenyl]methane sulfonamide N-{2-(cyclohexyloxy)-4-[hydroxy(oxido)amino]phenyl}methanesulfonamide NS398
Type:
Small organic molecule
Emp. Form.:
C13H18N2O5S
Mol. Mass.:
314.357
SMILES:
CS(=O)(=O)Nc1ccc(cc1OC1CCCCC1)[N+]([O-])=O
: