Target
Muscarinic acetylcholine receptor M2
Ligand
BDBM50110527
Substrate
Meas. Tech.
ChEBML_139772
Ki
0.700000±n/a nM
Citation
 Kozlowski, JAZhou, GTagat, JRLin, SIMcCombie, SWRuperto, VBDuffy, RAMcQuade, RACrosby, GTaylor, LABillard, WBinch, HLachowicz, JE Substituted 2-(R)-methyl piperazines as muscarinic M(2) selective ligands. Bioorg Med Chem Lett 12:791-4 (2002)  
Target
Name:
Muscarinic acetylcholine receptor M2
Synonyms:
ACM2_HUMAN Cholinergic, muscarinic M2 Muscarinic acetylcholine receptor M2 and M5 | RecName: Full=Muscarinic acetylcholine receptor M2
Type:
GPCR
Mol. Mass.:
51730.61
Organism:
Homo sapiens (Human)
Description:
P08172
Residue:
466
  
Inhibitor
Name:
BDBM50110527
Synonyms:
(R)-1-{(S)-1-[4-(Benzo[1,3]dioxole-5-sulfonyl)-phenyl]-ethyl}-4-(1-ethanesulfonyl-piperidin-4-yl)-2-methyl-piperazine CHEMBL163714
Type:
Small organic molecule
Emp. Form.:
C27H37N3O6S2
Mol. Mass.:
563.729
SMILES:
CCS(=O)(=O)N1CCC(CC1)N1CCN([C@@H](C)c2ccc(cc2)S(=O)(=O)c2ccc3OCOc3c2)[C@H](C)C1
: