Target
Muscarinic acetylcholine receptor M2
Ligand
BDBM50110528
Substrate
Meas. Tech.
ChEBML_139772
Ki
0.200000±n/a nM
Citation
 Kozlowski, JAZhou, GTagat, JRLin, SIMcCombie, SWRuperto, VBDuffy, RAMcQuade, RACrosby, GTaylor, LABillard, WBinch, HLachowicz, JE Substituted 2-(R)-methyl piperazines as muscarinic M(2) selective ligands. Bioorg Med Chem Lett 12:791-4 (2002)  
Target
Name:
Muscarinic acetylcholine receptor M2
Synonyms:
ACM2_HUMAN Cholinergic, muscarinic M2 Muscarinic acetylcholine receptor M2 and M5 | RecName: Full=Muscarinic acetylcholine receptor M2
Type:
GPCR
Mol. Mass.:
51730.61
Organism:
Homo sapiens (Human)
Description:
P08172
Residue:
466
  
Inhibitor
Name:
BDBM50110528
Synonyms:
1-{1-[4-(Benzo[1,3]dioxole-5-sulfonyl)-phenyl]-ethyl}-2-methyl-4-[1-(propane-1-sulfonyl)-piperidin-4-yl]-piperazine | CHEMBL165375
Type:
Small organic molecule
Emp. Form.:
C28H39N3O6S2
Mol. Mass.:
577.756
SMILES:
CCCS(=O)(=O)N1CCC(CC1)N1CCN([C@@H](C)c2ccc(cc2)S(=O)(=O)c2ccc3OCOc3c2)[C@H](C)C1
: