Target
Muscarinic acetylcholine receptor M2
Ligand
BDBM50110530
Substrate
Meas. Tech.
ChEBML_139772
Ki
0.900000±n/a nM
Citation
 Kozlowski, JAZhou, GTagat, JRLin, SIMcCombie, SWRuperto, VBDuffy, RAMcQuade, RACrosby, GTaylor, LABillard, WBinch, HLachowicz, JE Substituted 2-(R)-methyl piperazines as muscarinic M(2) selective ligands. Bioorg Med Chem Lett 12:791-4 (2002)  
Target
Name:
Muscarinic acetylcholine receptor M2
Synonyms:
ACM2_HUMAN Cholinergic, muscarinic M2 Muscarinic acetylcholine receptor M2 and M5 | RecName: Full=Muscarinic acetylcholine receptor M2
Type:
GPCR
Mol. Mass.:
51730.61
Organism:
Homo sapiens (Human)
Description:
P08172
Residue:
466
  
Inhibitor
Name:
BDBM50110530
Synonyms:
CHEMBL349720 [4-(4-{1-[4-(Benzo[1,3]dioxole-5-sulfonyl)-phenyl]-ethyl}-3-methyl-piperazin-1-yl)-piperidin-1-yl]-phenyl-methanone
Type:
Small organic molecule
Emp. Form.:
C32H37N3O5S
Mol. Mass.:
575.718
SMILES:
C[C@H](N1CCN(C[C@H]1C)C1CCN(CC1)C(=O)c1ccccc1)c1ccc(cc1)S(=O)(=O)c1ccc2OCOc2c1
: