Target
Bifunctional dihydrofolate reductase-thymidylate synthase
Ligand
BDBM18779
Substrate
Meas. Tech.
ChEMBL_55402 (CHEMBL668411)
Ki
0.4±n/a nM
Citation
 Tarnchompoo, BSirichaiwat, CPhupong, WIntaraudom, CSirawaraporn, WKamchonwongpaisan, SVanichtanankul, JThebtaranonth, YYuthavong, Y Development of 2,4-diaminopyrimidines as antimalarials based on inhibition of the S108N and C59R+S108N mutants of dihydrofolate reductase from pyrimethamine-resistant Plasmodium falciparum. J Med Chem 45:1244-52 (2002)  
Target
Name:
Bifunctional dihydrofolate reductase-thymidylate synthase
Synonyms:
DHFR-TS Dihydrofolate Reductase-Thymidylate Synthase (DHFR-TS) Mutant KICB1 PfDHFR-TS double mutant (C59R+S108N)
Type:
Enzyme
Mol. Mass.:
71822.51
Organism:
Plasmodium falciparum (isolate K1 / Thailand)
Description:
The mutant clone was prepared by cassette mutagenesis using wildtype pfDHFR as a template, and expressed in E. coli.
Residue:
608
  
Inhibitor
Name:
BDBM18779
Synonyms:
6-ethyl-5-(4-methylphenyl)pyrimidine-2,4-diamine P17
Type:
Small organic molecule
Emp. Form.:
C13H16N4
Mol. Mass.:
228.2929
SMILES:
CCc1nc(N)nc(N)c1-c1ccc(C)cc1
: