Target
Sodium-dependent dopamine transporter
Ligand
BDBM50110782
Substrate
Meas. Tech.
ChEMBL_62957 (CHEMBL675677)
Ki
760±n/a nM
Citation
 Emond, PVercouillie, JInnis, RChalon, SMavel, SFrangin, YHalldin, CBesnard, JCGuilloteau, D Substituted diphenyl sulfides as selective serotonin transporter ligands: synthesis and in vitro evaluation. J Med Chem 45:1253-8 (2002)  
Target
Name:
Sodium-dependent dopamine transporter
Synonyms:
DA transporter SC6A3_RAT Sodium-dependent dopamine transporter | Sodium-dependent dopamine transporter (DAT)
Type:
Multi-pass membrane protein
Mol. Mass.:
68749.45
Organism:
Rattus norvegicus (rat)
Description:
P23977
Residue:
619
  
Inhibitor
Name:
BDBM50110782
Synonyms:
CHEMBL429065 | [5-Iodo-2-(2-methylaminomethyl-phenylsulfanyl)-phenyl]-methanol
Type:
Small organic molecule
Emp. Form.:
C15H16INOS
Mol. Mass.:
385.263
SMILES:
CNCc1ccccc1Sc1ccc(I)cc1CO
: