Target
Adenylate cyclase type 2
Ligand
BDBM50551412
Substrate
Meas. Tech.
ChEMBL_2031281 (CHEMBL4685439)
EC50
430±n/a nM
Citation
 Xu, GYang, YYang, YSong, GLi, SZhang, JYang, WWang, LLWeng, ZZuo, Z The discovery, design and synthesis of potent agonists of adenylyl cyclase type 2 by virtual screening combining biological evaluation. Eur J Med Chem 191:0 (2020)  
Target
Name:
Adenylate cyclase type 2
Synonyms:
4.6.1.1 ADCY2_HUMAN Adenylate cyclase type 2 Adenylyl cyclase 2 | KIAA1060
Type:
PROTEIN
Mol. Mass.:
123627.70
Organism:
Homo sapiens (Human)
Description:
ChEMBL_104878
Residue:
1091
  
Inhibitor
Name:
BDBM50551412
Synonyms:
CHEMBL4764988
Type:
Small organic molecule
Emp. Form.:
C28H20ClNO5
Mol. Mass.:
485.915
SMILES:
[H][C@]12[C@H](OC3(C(=O)c4ccccc4C3=O)[C@@]1([H])C(=O)N(C2=O)c1ccc(CC)cc1)c1ccc(Cl)cc1
: