Target
Genome polyprotein
Ligand
BDBM50111455
Substrate
Meas. Tech.
ChEMBL_158819 (CHEMBL761628)
EC50
48±n/a nM
Citation
 Dragovich, PSPrins, TJZhou, RBrown, ELMaldonado, FCFuhrman, SAZalman, LSTuntland, TLee, CAPatick, AKMatthews, DAHendrickson, TFKosa, MBLiu, BBatugo, MRGleeson, JPSakata, SKChen, LGuzman, MCMeador, JWFerre, RAWorland, ST Structure-based design, synthesis, and biological evaluation of irreversible human rhinovirus 3C protease inhibitors. 6. Structure-activity studies of orally bioavailable, 2-pyridone-containing peptidomimetics. J Med Chem 45:1607-23 (2002)  
Target
Name:
Genome polyprotein
Synonyms:
Human rhinovirus A protease | Human rhinovirus B 3A protease
Type:
PROTEIN
Mol. Mass.:
44361.04
Organism:
Human rhinovirus B
Description:
ChEMBL_158953
Residue:
401
  
Inhibitor
Name:
BDBM50111455
Synonyms:
(1S,5S)-4-((S)-3-(3,4-Difluoro-phenyl)-2-{3-[(5-methyl-isoxazole-3-carbonyl)-amino]-2-oxo-2H-pyridin-1-yl}-propionylamino)-5-(2-oxo-pyrrolidin-3-yl)-pent-2-enoic acid isopropyl ester CHEMBL291276
Type:
Small organic molecule
Emp. Form.:
C31H33F2N5O7
Mol. Mass.:
625.6198
SMILES:
CC(C)OC(=O)\C=C\[C@H](C[C@@H]1CCNC1=O)NC(=O)[C@H](Cc1ccc(F)c(F)c1)n1cccc(NC(=O)c2cc(C)on2)c1=O
: