Target
Steroid 17-alpha-hydroxylase/17,20 lyase
Ligand
BDBM50318484
Substrate
Meas. Tech.
ChEMBL_2033579 (CHEMBL4687737)
Ki
124000±n/a nM
Citation
 Nelson, KMBisson, JSingh, GGraham, JGChen, SNFriesen, JBDahlin, JLNiemitz, MWalters, MAPauli, GF The Essential Medicinal Chemistry of Cannabidiol (CBD). J Med Chem 63:12137-12155 (2020)  
Target
Name:
Steroid 17-alpha-hydroxylase/17,20 lyase
Synonyms:
CP17A_RAT Cyp17a1 Cytochrome P450 17A1 Steroid 17-alpha-hydroxylase/17,20 lyase
Type:
Enzyme
Mol. Mass.:
57255.68
Organism:
Rattus norvegicus (Rat)
Description:
P11715
Residue:
507
  
Inhibitor
Name:
BDBM50318484
Synonyms:
2-((1R,6R)-6-Isopropenyl-3-methyl-cyclohex-2-enyl)-5-pentyl-benzene-1,3-diol CHEMBL190461
Type:
Small organic molecule
Emp. Form.:
C21H30O2
Mol. Mass.:
314.4617
SMILES:
CCCCCc1cc(O)c([C@@H]2C=C(C)CC[C@H]2C(C)=C)c(O)c1
: