Target
Prothrombin
Ligand
BDBM50111733
Substrate
Meas. Tech.
ChEBML_208494
Ki
85±n/a nM
Citation
 Reiner, JESiev, DVAraldi, GLCui, JJHo, JZReddy, KMMamedova, LVu, PHLee, KSMinami, NKGibson, TSAnderson, SMBradbury, AENolan, TGSemple, JE Non-covalent thrombin inhibitors featuring P(3)-heterocycles with P(1)-monocyclic arginine surrogates. Bioorg Med Chem Lett 12:1203-8 (2002)  
Target
Name:
Prothrombin
Synonyms:
Activation peptide fragment 1 Coagulation factor II Prothrombin precursor Thrombin heavy chain | Thrombin light chain
Type:
Protein
Mol. Mass.:
70029.57
Organism:
Homo sapiens (Human)
Description:
P00734
Residue:
622
  
Inhibitor
Name:
BDBM50111733
Synonyms:
CHEMBL283945 | N-(2-Amino-4-methyl-pyrimidin-5-ylmethyl)-2-(6-methyl-2-oxo-3-phenylmethanesulfonylamino-2H-pyridin-1-yl)-acetamide
Type:
Small organic molecule
Emp. Form.:
C21H24N6O4S
Mol. Mass.:
456.518
SMILES:
Cc1nc(N)ncc1CNC(=O)Cn1c(C)ccc(NS(=O)(=O)Cc2ccccc2)c1=O
: