Target
Adenosine receptor A1
Ligand
BDBM50112186
Substrate
Meas. Tech.
ChEMBL_29610 (CHEMBL642892)
Ki
4.3±n/a nM
Citation
 Van Calenbergh, SLink, AFujikawa, Sde Ligt, RAVanheusden, VGolisade, ABlaton, NMRozenski, JIJzerman, APHerdewijn, P 5'-Deoxy congeners of 9-(3-amido-3-deoxy-beta-D-xylofuranosyl)-N(6)-cyclopentyladenine: new adenosine A(1) receptor antagonists and inverse agonists. J Med Chem 45:1845-52 (2002)  
Target
Name:
Adenosine receptor A1
Synonyms:
AA1R_RAT ADENOSINE A1 high Adenosine A1 receptor (A1) Adenosine receptors A1 | Adora1
Type:
Protein
Mol. Mass.:
36704.13
Organism:
Rattus norvegicus (rat)
Description:
Residue:
326
  
Inhibitor
Name:
BDBM50112186
Synonyms:
5-(6-Cyclopentylamino-purin-9-yl)-2-hydroxymethyl-tetrahydro-furan-3-ol | CHEMBL299504
Type:
Small organic molecule
Emp. Form.:
C15H21N5O3
Mol. Mass.:
319.3589
SMILES:
OC[C@H]1O[C@H](C[C@H]1O)n1cnc2c(NC3CCCC3)ncnc12
: