Target
Coagulation factor X
Ligand
BDBM50112503
Substrate
Meas. Tech.
ChEBML_49302
Ki
0.080000±n/a nM
Citation
 Wu, SGuilford, WJChou, YLGriedel, BDLiang, ASakata, SShaw, KJTrinh, LXu, WZhao, ZMorrissey, MM Design and synthesis of aminophenol-based factor Xa inhibitors. Bioorg Med Chem Lett 12:1307-10 (2002)  
Target
Name:
Coagulation factor X
Synonyms:
Activated coagulation factor X (FXa) Coagulation factor X precursor F10 Factor X heavy chain Factor Xa Stuart-Prower factor
Type:
Enzyme
Mol. Mass.:
54726.60
Organism:
Homo sapiens (Human)
Description:
Residue:
488
  
Inhibitor
Name:
BDBM50112503
Synonyms:
7-({4-[1-(1-Imino-ethyl)-piperidin-4-yloxy]-3-nitro-phenylamino}-methyl)-naphthalene-2-carboxamidine | CHEMBL25034
Type:
Small organic molecule
Emp. Form.:
C25H28N6O3
Mol. Mass.:
460.5282
SMILES:
CC([NH-])=[N+]1CCC(CC1)Oc1ccc(NCc2ccc3ccc(cc3c2)C(N)=N)cc1[N+]([O-])=O
: