Target
Prothrombin
Ligand
BDBM50112511
Substrate
Meas. Tech.
ChEBML_208903
Ki
190±n/a nM
Citation
 Shaw, KJGuilford, WJGriedel, BDSakata, STrinh, LWu, SXu, WZhao, ZMorrissey, MM Benzimidazole-based fXa inhibitors with improved thrombin and trypsin selectivity. Bioorg Med Chem Lett 12:1311-4 (2002)  
Target
Name:
Prothrombin
Synonyms:
Activation peptide fragment 1 Coagulation factor II Prothrombin precursor Thrombin heavy chain | Thrombin light chain
Type:
Protein
Mol. Mass.:
70029.57
Organism:
Homo sapiens (Human)
Description:
P00734
Residue:
622
  
Inhibitor
Name:
BDBM50112511
Synonyms:
3'-{2-Ethyl-6-[1-(1-imino-ethyl)-piperidin-4-yloxy]-benzoimidazol-1-ylmethyl}-biphenyl-3-carboxamidine | CHEMBL282260
Type:
Small organic molecule
Emp. Form.:
C30H34N6O
Mol. Mass.:
494.6306
SMILES:
CCc1nc2ccc(OC3CCN(CC3)C(C)=N)cc2n1Cc1cccc(c1)-c1cccc(c1)C(N)=N
: