Target
Coagulation factor X
Ligand
BDBM50112494
Substrate
Meas. Tech.
ChEBML_49327
Ki
0.300000±n/a nM
Citation
 Shaw, KJGuilford, WJGriedel, BDSakata, STrinh, LWu, SXu, WZhao, ZMorrissey, MM Benzimidazole-based fXa inhibitors with improved thrombin and trypsin selectivity. Bioorg Med Chem Lett 12:1311-4 (2002)  
Target
Name:
Coagulation factor X
Synonyms:
Activated coagulation factor X (FXa) Coagulation factor X precursor F10 Factor X heavy chain Factor Xa Stuart-Prower factor
Type:
Enzyme
Mol. Mass.:
54726.60
Organism:
Homo sapiens (Human)
Description:
Residue:
488
  
Inhibitor
Name:
BDBM50112494
Synonyms:
7-{5-[1-(1-Imino-ethyl)-piperidin-4-yloxy]-2-methyl-4-nitro-benzoimidazol-1-ylmethyl}-naphthalene-2-carboxamidine | CHEMBL25351
Type:
Small organic molecule
Emp. Form.:
C27H29N7O3
Mol. Mass.:
499.5643
SMILES:
CC([NH-])=[N+]1CCC(CC1)Oc1ccc2n(Cc3ccc4ccc(cc4c3)C(N)=N)c(C)nc2c1[N+]([O-])=O
: