Target
Prothrombin
Ligand
BDBM50088957
Substrate
Meas. Tech.
ChEBML_208903
Ki
2000±n/a nM
Citation
 Shaw, KJGuilford, WJGriedel, BDSakata, STrinh, LWu, SXu, WZhao, ZMorrissey, MM Benzimidazole-based fXa inhibitors with improved thrombin and trypsin selectivity. Bioorg Med Chem Lett 12:1311-4 (2002)  
Target
Name:
Prothrombin
Synonyms:
Activation peptide fragment 1 Coagulation factor II Prothrombin precursor Thrombin heavy chain | Thrombin light chain
Type:
Protein
Mol. Mass.:
70029.57
Organism:
Homo sapiens (Human)
Description:
P00734
Residue:
622
  
Inhibitor
Name:
BDBM50088957
Synonyms:
7-{2-Ethyl-5-[1-(1-imino-ethyl)-piperidin-4-yloxy]-benzoimidazol-1-ylmethyl}-naphthalene-2-carboxamidine | CHEMBL24907
Type:
Small organic molecule
Emp. Form.:
C28H32N6O
Mol. Mass.:
468.5933
SMILES:
CCc1nc2cc(OC3CCN(CC3)C(C)=N)ccc2n1Cc1ccc2ccc(cc2c1)C(N)=N
: